{"text_format":"3","workbook":"xlsx","n_sheets":4,"sheets":["申込み手順","入力シート","参加承諾書","名簿"],"not_rendered":{"macros":1,"defined_names":6},"read":"whole","date_system":"1900"}

{"sheet":"申込み手順","index":0,"n_rows":28,"n_cols":13,"rows_kept":28,"merged":[[2,0,2,13],[5,2,5,13],[6,5,6,9],[7,5,7,7]]}
[]
[{"$nulls":11},"2024-06-05","版"]
["第18回　大阪市スポーツ協会会長杯　新体操ジュニア選手権大会\n兼　大阪新体操選手権大会　予選会（Ⅰ）　申込書(女子）　入力手順"]
[]
[1,null,"以下の手順に従い申込書を作成して下さい。"]
[2,null,"ファイル名「第18回会長杯　○○クラブ.xlsm」で任意の場所に『名前を付けて保存』してください。"]
[3,null,"所属名を入力して下さい。→",{"$nulls":7},"※申込書に反映されます。"]
[4,null,"所属長名を入力して下さい→",{"$nulls":5},"※申込書に反映されます。"]
[5,null,"作業は「入力シート」で行います。"]
[null,null,"●","ＪＧＡ登録NOを入力すると指導者情報（JGA登録情報）が表示されます。"]
[null,null,"●","出場種目・帯同コーチに1を入力してください。"]
[null,null,"●","補欠登録には2を入力してください。（団体２名登録できます）"]
[null,null,"●","帯同コーチは４名まで登録可能です。（コロナ感染者増加の場合、また入館制限する場合があります。）"]
[{"$nulls":3},"※5/??以降に登録された場合、登録番号を入力してもエラーが表示されます。"]
[{"$nulls":3},"　６月に入ってから大阪体操協会HPにて申込みフォーム更新のお知らせをしますので、再度ダウンロードして下さい。"]
[6,null,"「参加承諾書」　必要枚数を印刷して記入をお願いします。（大会当日提出）"]
[7,null,"「入力シート」に振り込みの明細が表示されています。合計金額をご確認ください。"]
[8,null,"エクセルデータをメールにて送信して下さい。　"]
[null,null,"添付ファイル名 と メールの件名を「第18回会長杯　○〇クラブ」として下さい。"]
[{"$nulls":4},"送信先","kyogi.rg@gmail.com"]
[9,null,"振込先及び振込締切　6月24日（月）振込有効"]
[{"$nulls":4},"振込先","りそな銀行　",null,"吹田支店"]
[{"$nulls":5},"口座番号",null,"普通００１５６１４"]
[{"$nulls":5},"名　　　義",null,"大阪体操協会　田中範子"]
[null,null,"「入力シート」に銀行振り込みの明細表（コピー可）を貼り付けて下さい。(大会当日提出）"]
[10,null,"申込み期間　令和6年6月4日(火)～6月24日(月)　メール必着"]
[]
[null,null,"以上"]

{"sheet":"入力シート","index":1,"n_rows":67,"n_cols":10,"rows_kept":67,"merged":[[0,1,0,9],[2,1,3,1],[2,2,3,6],[2,7,3,7],[2,8,3,9],[6,7,6,8],[8,4,8,5],[9,4,9,5],[13,1,15,1],[13,2,15,2],[13,3,15,3],[13,4,15,4],[13,5,15,5],[13,7,13,8],[13,9,15,9],[14,7,14,8]]}
[null,"第18回　大阪市スポーツ協会会長杯　新体操ジュニア選手権大会\n兼　大阪新体操選手権大会　予選会（Ⅰ）　申込シート(女子）　"]
[]
[null,"所属団体名",{"$f":"申込み手順!F7","v":0},{"$nulls":4},"所属長",{"$f":"申込み手順!F8&\"　    印\"","v":"　    印"}]
[]
[]
[]
[{"$nulls":6},"団　体","個　　人",null,"帯同"]
[{"$nulls":6},"フープ５","４種目の部","２種目の部","コーチ"]
[{"$nulls":4},"参加人数",null,{"$f":"COUNTIF(G18:G37,1)","v":0},{"$f":"COUNTIF(H18:H37,1)","v":0},{"$f":"COUNTIF(I18:I37,1)","v":0},{"$f":"COUNTIF(J18:J37,1)","v":0}]
[{"$nulls":4},"参　加　料",null,{"$f":"IF(G9>=5,20000,0)","v":{"v":0,"d":"0 "}},{"$f":"H9*12000","v":{"v":0,"d":"0 "}},{"$f":"I9*10000","v":{"v":0,"d":"0 "}}]
[{"$nulls":7},"合計金額",{"$f":"SUM(G10:I10)","v":{"v":0,"d":"0 "}},"円"]
[]
[]
[null,"ＪＧＡ\n登録NO","氏 名","フリガナ","生年月日","学年","団　体","個　　人",null,"帯同\nコーチ"]
[]
[{"$nulls":6},"フープ５","４種目の部","２種目の部"]
[null,1,2,3,4,5,6,7,8,9]
[1,null,{"$f":"IF(B18=\"\",\"\",VLOOKUP(B18,名簿!$A$2:$S$1039,2,0))","v":""},{"$f":"IF(B18=\"\",\"\",VLOOKUP(B18,名簿!$A$2:$S$1039,3,0))","v":""},{"$f":"IF(B18=\"\",\"\",VLOOKUP(B18,名簿!$A$2:$S$1039,5,0))","v":""},{"$f":"IF(E18=\"\",\"\",VLOOKUP(DATEDIF(E18,DATE(IF(MONTH(TODAY())<=3,YEAR(TODAY())-1,YEAR(TODAY())),4,1),\"Y\"),{0,\"幼児\";6,\"小１\";7,\"小２\";8,\"小３\";9,\"小４\";10,\"小５\";11,\"小６\";12,\"中１\";13,\"中２\";14,\"中３\";15,\"高1\";16,\"高2\";17,\"高3\";18,\"\"},2,1))","v":""}]
[2,null,{"$f":"IF(B19=\"\",\"\",VLOOKUP(B19,名簿!$A$2:$S$1039,2,0))","v":""},{"$f":"IF(B19=\"\",\"\",VLOOKUP(B19,名簿!$A$2:$S$1039,3,0))","v":""},{"$f":"IF(B19=\"\",\"\",VLOOKUP(B19,名簿!$A$2:$S$1039,5,0))","v":""},{"$f":"IF(E19=\"\",\"\",VLOOKUP(DATEDIF(E19,DATE(IF(MONTH(TODAY())<=3,YEAR(TODAY())-1,YEAR(TODAY())),4,1),\"Y\"),{0,\"幼児\";6,\"小１\";7,\"小２\";8,\"小３\";9,\"小４\";10,\"小５\";11,\"小６\";12,\"中１\";13,\"中２\";14,\"中３\";15,\"高1\";16,\"高2\";17,\"高3\";18,\"\"},2,1))","v":""}]
[3,null,{"$f":"IF(B20=\"\",\"\",VLOOKUP(B20,名簿!$A$2:$S$1039,2,0))","v":""},{"$f":"IF(B20=\"\",\"\",VLOOKUP(B20,名簿!$A$2:$S$1039,3,0))","v":""},{"$f":"IF(B20=\"\",\"\",VLOOKUP(B20,名簿!$A$2:$S$1039,5,0))","v":""},{"$f":"IF(E20=\"\",\"\",VLOOKUP(DATEDIF(E20,DATE(IF(MONTH(TODAY())<=3,YEAR(TODAY())-1,YEAR(TODAY())),4,1),\"Y\"),{0,\"幼児\";6,\"小１\";7,\"小２\";8,\"小３\";9,\"小４\";10,\"小５\";11,\"小６\";12,\"中１\";13,\"中２\";14,\"中３\";15,\"高1\";16,\"高2\";17,\"高3\";18,\"\"},2,1))","v":""}]
[4,null,{"$f":"IF(B21=\"\",\"\",VLOOKUP(B21,名簿!$A$2:$S$1039,2,0))","v":""},{"$f":"IF(B21=\"\",\"\",VLOOKUP(B21,名簿!$A$2:$S$1039,3,0))","v":""},{"$f":"IF(B21=\"\",\"\",VLOOKUP(B21,名簿!$A$2:$S$1039,5,0))","v":""},{"$f":"IF(E21=\"\",\"\",VLOOKUP(DATEDIF(E21,DATE(IF(MONTH(TODAY())<=3,YEAR(TODAY())-1,YEAR(TODAY())),4,1),\"Y\"),{0,\"幼児\";6,\"小１\";7,\"小２\";8,\"小３\";9,\"小４\";10,\"小５\";11,\"小６\";12,\"中１\";13,\"中２\";14,\"中３\";15,\"高1\";16,\"高2\";17,\"高3\";18,\"\"},2,1))","v":""}]
[5,null,{"$f":"IF(B22=\"\",\"\",VLOOKUP(B22,名簿!$A$2:$S$1039,2,0))","v":""},{"$f":"IF(B22=\"\",\"\",VLOOKUP(B22,名簿!$A$2:$S$1039,3,0))","v":""},{"$f":"IF(B22=\"\",\"\",VLOOKUP(B22,名簿!$A$2:$S$1039,5,0))","v":""},{"$f":"IF(E22=\"\",\"\",VLOOKUP(DATEDIF(E22,DATE(IF(MONTH(TODAY())<=3,YEAR(TODAY())-1,YEAR(TODAY())),4,1),\"Y\"),{0,\"幼児\";6,\"小１\";7,\"小２\";8,\"小３\";9,\"小４\";10,\"小５\";11,\"小６\";12,\"中１\";13,\"中２\";14,\"中３\";15,\"高1\";16,\"高2\";17,\"高3\";18,\"\"},2,1))","v":""}]
[6,null,{"$f":"IF(B23=\"\",\"\",VLOOKUP(B23,名簿!$A$2:$S$1039,2,0))","v":""},{"$f":"IF(B23=\"\",\"\",VLOOKUP(B23,名簿!$A$2:$S$1039,3,0))","v":""},{"$f":"IF(B23=\"\",\"\",VLOOKUP(B23,名簿!$A$2:$S$1039,5,0))","v":""},{"$f":"IF(E23=\"\",\"\",VLOOKUP(DATEDIF(E23,DATE(IF(MONTH(TODAY())<=3,YEAR(TODAY())-1,YEAR(TODAY())),4,1),\"Y\"),{0,\"幼児\";6,\"小１\";7,\"小２\";8,\"小３\";9,\"小４\";10,\"小５\";11,\"小６\";12,\"中１\";13,\"中２\";14,\"中３\";15,\"高1\";16,\"高2\";17,\"高3\";18,\"\"},2,1))","v":""}]
[7,null,{"$f":"IF(B24=\"\",\"\",VLOOKUP(B24,名簿!$A$2:$S$1039,2,0))","v":""},{"$f":"IF(B24=\"\",\"\",VLOOKUP(B24,名簿!$A$2:$S$1039,3,0))","v":""},{"$f":"IF(B24=\"\",\"\",VLOOKUP(B24,名簿!$A$2:$S$1039,5,0))","v":""},{"$f":"IF(E24=\"\",\"\",VLOOKUP(DATEDIF(E24,DATE(IF(MONTH(TODAY())<=3,YEAR(TODAY())-1,YEAR(TODAY())),4,1),\"Y\"),{0,\"幼児\";6,\"小１\";7,\"小２\";8,\"小３\";9,\"小４\";10,\"小５\";11,\"小６\";12,\"中１\";13,\"中２\";14,\"中３\";15,\"高1\";16,\"高2\";17,\"高3\";18,\"\"},2,1))","v":""}]
[8,null,{"$f":"IF(B25=\"\",\"\",VLOOKUP(B25,名簿!$A$2:$S$1039,2,0))","v":""},{"$f":"IF(B25=\"\",\"\",VLOOKUP(B25,名簿!$A$2:$S$1039,3,0))","v":""},{"$f":"IF(B25=\"\",\"\",VLOOKUP(B25,名簿!$A$2:$S$1039,5,0))","v":""},{"$f":"IF(E25=\"\",\"\",VLOOKUP(DATEDIF(E25,DATE(IF(MONTH(TODAY())<=3,YEAR(TODAY())-1,YEAR(TODAY())),4,1),\"Y\"),{0,\"幼児\";6,\"小１\";7,\"小２\";8,\"小３\";9,\"小４\";10,\"小５\";11,\"小６\";12,\"中１\";13,\"中２\";14,\"中３\";15,\"高1\";16,\"高2\";17,\"高3\";18,\"\"},2,1))","v":""}]
[9,null,{"$f":"IF(B26=\"\",\"\",VLOOKUP(B26,名簿!$A$2:$S$1039,2,0))","v":""},{"$f":"IF(B26=\"\",\"\",VLOOKUP(B26,名簿!$A$2:$S$1039,3,0))","v":""},{"$f":"IF(B26=\"\",\"\",VLOOKUP(B26,名簿!$A$2:$S$1039,5,0))","v":""},{"$f":"IF(E26=\"\",\"\",VLOOKUP(DATEDIF(E26,DATE(IF(MONTH(TODAY())<=3,YEAR(TODAY())-1,YEAR(TODAY())),4,1),\"Y\"),{0,\"幼児\";6,\"小１\";7,\"小２\";8,\"小３\";9,\"小４\";10,\"小５\";11,\"小６\";12,\"中１\";13,\"中２\";14,\"中３\";15,\"高1\";16,\"高2\";17,\"高3\";18,\"\"},2,1))","v":""}]
[10,null,{"$f":"IF(B27=\"\",\"\",VLOOKUP(B27,名簿!$A$2:$S$1039,2,0))","v":""},{"$f":"IF(B27=\"\",\"\",VLOOKUP(B27,名簿!$A$2:$S$1039,3,0))","v":""},{"$f":"IF(B27=\"\",\"\",VLOOKUP(B27,名簿!$A$2:$S$1039,5,0))","v":""},{"$f":"IF(E27=\"\",\"\",VLOOKUP(DATEDIF(E27,DATE(IF(MONTH(TODAY())<=3,YEAR(TODAY())-1,YEAR(TODAY())),4,1),\"Y\"),{0,\"幼児\";6,\"小１\";7,\"小２\";8,\"小３\";9,\"小４\";10,\"小５\";11,\"小６\";12,\"中１\";13,\"中２\";14,\"中３\";15,\"高1\";16,\"高2\";17,\"高3\";18,\"\"},2,1))","v":""}]
[11,null,{"$f":"IF(B28=\"\",\"\",VLOOKUP(B28,名簿!$A$2:$S$1039,2,0))","v":""},{"$f":"IF(B28=\"\",\"\",VLOOKUP(B28,名簿!$A$2:$S$1039,3,0))","v":""},{"$f":"IF(B28=\"\",\"\",VLOOKUP(B28,名簿!$A$2:$S$1039,5,0))","v":""},{"$f":"IF(E28=\"\",\"\",VLOOKUP(DATEDIF(E28,DATE(IF(MONTH(TODAY())<=3,YEAR(TODAY())-1,YEAR(TODAY())),4,1),\"Y\"),{0,\"幼児\";6,\"小１\";7,\"小２\";8,\"小３\";9,\"小４\";10,\"小５\";11,\"小６\";12,\"中１\";13,\"中２\";14,\"中３\";15,\"高1\";16,\"高2\";17,\"高3\";18,\"\"},2,1))","v":""}]
[12,null,{"$f":"IF(B29=\"\",\"\",VLOOKUP(B29,名簿!$A$2:$S$1039,2,0))","v":""},{"$f":"IF(B29=\"\",\"\",VLOOKUP(B29,名簿!$A$2:$S$1039,3,0))","v":""},{"$f":"IF(B29=\"\",\"\",VLOOKUP(B29,名簿!$A$2:$S$1039,5,0))","v":""},{"$f":"IF(E29=\"\",\"\",VLOOKUP(DATEDIF(E29,DATE(IF(MONTH(TODAY())<=3,YEAR(TODAY())-1,YEAR(TODAY())),4,1),\"Y\"),{0,\"幼児\";6,\"小１\";7,\"小２\";8,\"小３\";9,\"小４\";10,\"小５\";11,\"小６\";12,\"中１\";13,\"中２\";14,\"中３\";15,\"高1\";16,\"高2\";17,\"高3\";18,\"\"},2,1))","v":""}]
[13,null,{"$f":"IF(B30=\"\",\"\",VLOOKUP(B30,名簿!$A$2:$S$1039,2,0))","v":""},{"$f":"IF(B30=\"\",\"\",VLOOKUP(B30,名簿!$A$2:$S$1039,3,0))","v":""},{"$f":"IF(B30=\"\",\"\",VLOOKUP(B30,名簿!$A$2:$S$1039,5,0))","v":""},{"$f":"IF(E30=\"\",\"\",VLOOKUP(DATEDIF(E30,DATE(IF(MONTH(TODAY())<=3,YEAR(TODAY())-1,YEAR(TODAY())),4,1),\"Y\"),{0,\"幼児\";6,\"小１\";7,\"小２\";8,\"小３\";9,\"小４\";10,\"小５\";11,\"小６\";12,\"中１\";13,\"中２\";14,\"中３\";15,\"高1\";16,\"高2\";17,\"高3\";18,\"\"},2,1))","v":""}]
[14,null,{"$f":"IF(B31=\"\",\"\",VLOOKUP(B31,名簿!$A$2:$S$1039,2,0))","v":""},{"$f":"IF(B31=\"\",\"\",VLOOKUP(B31,名簿!$A$2:$S$1039,3,0))","v":""},{"$f":"IF(B31=\"\",\"\",VLOOKUP(B31,名簿!$A$2:$S$1039,5,0))","v":""},{"$f":"IF(E31=\"\",\"\",VLOOKUP(DATEDIF(E31,DATE(IF(MONTH(TODAY())<=3,YEAR(TODAY())-1,YEAR(TODAY())),4,1),\"Y\"),{0,\"幼児\";6,\"小１\";7,\"小２\";8,\"小３\";9,\"小４\";10,\"小５\";11,\"小６\";12,\"中１\";13,\"中２\";14,\"中３\";15,\"高1\";16,\"高2\";17,\"高3\";18,\"\"},2,1))","v":""}]
[15,null,{"$f":"IF(B32=\"\",\"\",VLOOKUP(B32,名簿!$A$2:$S$1039,2,0))","v":""},{"$f":"IF(B32=\"\",\"\",VLOOKUP(B32,名簿!$A$2:$S$1039,3,0))","v":""},{"$f":"IF(B32=\"\",\"\",VLOOKUP(B32,名簿!$A$2:$S$1039,5,0))","v":""},{"$f":"IF(E32=\"\",\"\",VLOOKUP(DATEDIF(E32,DATE(IF(MONTH(TODAY())<=3,YEAR(TODAY())-1,YEAR(TODAY())),4,1),\"Y\"),{0,\"幼児\";6,\"小１\";7,\"小２\";8,\"小３\";9,\"小４\";10,\"小５\";11,\"小６\";12,\"中１\";13,\"中２\";14,\"中３\";15,\"高1\";16,\"高2\";17,\"高3\";18,\"\"},2,1))","v":""}]
[16,null,{"$f":"IF(B33=\"\",\"\",VLOOKUP(B33,名簿!$A$2:$S$1039,2,0))","v":""},{"$f":"IF(B33=\"\",\"\",VLOOKUP(B33,名簿!$A$2:$S$1039,3,0))","v":""},{"$f":"IF(B33=\"\",\"\",VLOOKUP(B33,名簿!$A$2:$S$1039,5,0))","v":""},{"$f":"IF(E33=\"\",\"\",VLOOKUP(DATEDIF(E33,DATE(IF(MONTH(TODAY())<=3,YEAR(TODAY())-1,YEAR(TODAY())),4,1),\"Y\"),{0,\"幼児\";6,\"小１\";7,\"小２\";8,\"小３\";9,\"小４\";10,\"小５\";11,\"小６\";12,\"中１\";13,\"中２\";14,\"中３\";15,\"高1\";16,\"高2\";17,\"高3\";18,\"\"},2,1))","v":""}]
[17,null,{"$f":"IF(B34=\"\",\"\",VLOOKUP(B34,名簿!$A$2:$S$1039,2,0))","v":""},{"$f":"IF(B34=\"\",\"\",VLOOKUP(B34,名簿!$A$2:$S$1039,3,0))","v":""},{"$f":"IF(B34=\"\",\"\",VLOOKUP(B34,名簿!$A$2:$S$1039,5,0))","v":""},{"$f":"IF(E34=\"\",\"\",VLOOKUP(DATEDIF(E34,DATE(IF(MONTH(TODAY())<=3,YEAR(TODAY())-1,YEAR(TODAY())),4,1),\"Y\"),{0,\"幼児\";6,\"小１\";7,\"小２\";8,\"小３\";9,\"小４\";10,\"小５\";11,\"小６\";12,\"中１\";13,\"中２\";14,\"中３\";15,\"高1\";16,\"高2\";17,\"高3\";18,\"\"},2,1))","v":""}]
[18,null,{"$f":"IF(B35=\"\",\"\",VLOOKUP(B35,名簿!$A$2:$S$1039,2,0))","v":""},{"$f":"IF(B35=\"\",\"\",VLOOKUP(B35,名簿!$A$2:$S$1039,3,0))","v":""},{"$f":"IF(B35=\"\",\"\",VLOOKUP(B35,名簿!$A$2:$S$1039,5,0))","v":""},{"$f":"IF(E35=\"\",\"\",VLOOKUP(DATEDIF(E35,DATE(IF(MONTH(TODAY())<=3,YEAR(TODAY())-1,YEAR(TODAY())),4,1),\"Y\"),{0,\"幼児\";6,\"小１\";7,\"小２\";8,\"小３\";9,\"小４\";10,\"小５\";11,\"小６\";12,\"中１\";13,\"中２\";14,\"中３\";15,\"高1\";16,\"高2\";17,\"高3\";18,\"\"},2,1))","v":""}]
[19,null,{"$f":"IF(B36=\"\",\"\",VLOOKUP(B36,名簿!$A$2:$S$1039,2,0))","v":""},{"$f":"IF(B36=\"\",\"\",VLOOKUP(B36,名簿!$A$2:$S$1039,3,0))","v":""},{"$f":"IF(B36=\"\",\"\",VLOOKUP(B36,名簿!$A$2:$S$1039,5,0))","v":""},{"$f":"IF(E36=\"\",\"\",VLOOKUP(DATEDIF(E36,DATE(IF(MONTH(TODAY())<=3,YEAR(TODAY())-1,YEAR(TODAY())),4,1),\"Y\"),{0,\"幼児\";6,\"小１\";7,\"小２\";8,\"小３\";9,\"小４\";10,\"小５\";11,\"小６\";12,\"中１\";13,\"中２\";14,\"中３\";15,\"高1\";16,\"高2\";17,\"高3\";18,\"\"},2,1))","v":""}]
[20,null,{"$f":"IF(B37=\"\",\"\",VLOOKUP(B37,名簿!$A$2:$S$1039,2,0))","v":""},{"$f":"IF(B37=\"\",\"\",VLOOKUP(B37,名簿!$A$2:$S$1039,3,0))","v":""},{"$f":"IF(B37=\"\",\"\",VLOOKUP(B37,名簿!$A$2:$S$1039,5,0))","v":""},{"$f":"IF(E37=\"\",\"\",VLOOKUP(DATEDIF(E37,DATE(IF(MONTH(TODAY())<=3,YEAR(TODAY())-1,YEAR(TODAY())),4,1),\"Y\"),{0,\"幼児\";6,\"小１\";7,\"小２\";8,\"小３\";9,\"小４\";10,\"小５\";11,\"小６\";12,\"中１\";13,\"中２\";14,\"中３\";15,\"高1\";16,\"高2\";17,\"高3\";18,\"\"},2,1))","v":""}]
[null,null,{"$f":"IF(B38=\"\",\"\",VLOOKUP(B38,名簿!$A$2:$S$1039,2,0))","v":""},{"$f":"IF(B38=\"\",\"\",VLOOKUP(B38,名簿!$A$2:$S$1039,3,0))","v":""},{"$f":"IF(B38=\"\",\"\",VLOOKUP(B38,名簿!$A$2:$S$1039,5,0))","v":""},{"$f":"IF(E38=\"\",\"\",VLOOKUP(DATEDIF(E38,DATE(IF(MONTH(TODAY())<=3,YEAR(TODAY())-1,YEAR(TODAY())),4,1),\"Y\"),{0,\"幼児\";6,\"小１\";7,\"小２\";8,\"小３\";9,\"小４\";10,\"小５\";11,\"小６\";12,\"中１\";13,\"中２\";14,\"中３\";15,\"高1\";16,\"高2\";17,\"高3\";18,\"\"},2,1))","v":""}]
[null,null,{"$f":"IF(B39=\"\",\"\",VLOOKUP(B39,名簿!$A$2:$S$1039,2,0))","v":""},{"$f":"IF(B39=\"\",\"\",VLOOKUP(B39,名簿!$A$2:$S$1039,3,0))","v":""},{"$f":"IF(B39=\"\",\"\",VLOOKUP(B39,名簿!$A$2:$S$1039,5,0))","v":""},{"$f":"IF(E39=\"\",\"\",VLOOKUP(DATEDIF(E39,DATE(IF(MONTH(TODAY())<=3,YEAR(TODAY())-1,YEAR(TODAY())),4,1),\"Y\"),{0,\"幼児\";6,\"小１\";7,\"小２\";8,\"小３\";9,\"小４\";10,\"小５\";11,\"小６\";12,\"中１\";13,\"中２\";14,\"中３\";15,\"高1\";16,\"高2\";17,\"高3\";18,\"\"},2,1))","v":""}]
[null,"※　","銀行振り込みの明細票　（コピー可）　を貼り付けて大会当日持参して下さい。"]
{"$rows_left_out":28}
{"sheet":"参加承諾書","index":2,"n_rows":41,"n_cols":9,"rows_kept":41,"merged":[[0,0,0,9],[4,0,4,9],[6,2,6,3],[6,4,6,7],[8,2,8,3],[8,4,8,7],[10,0,10,9],[12,2,13,2],[12,3,13,3],[13,4,13,9],[14,2,15,2],[14,3,15,3],[15,4,15,7],[17,7,17,9],[23,0,23,9],[27,0,27,9],[29,2,29,3],[29,4,29,7],[31,2,31,3],[31,4,31,7],[33,0,33,9],[35,2,36,2],[35,3,36,3],[36,4,36,9],[37,2,38,2],[37,3,38,3],[38,4,38,7],[40,7,40,9]]}
["大　会　参　加　承　諾　書"]
[]
["　　　大阪体操協会会長　様"]
[]
["　第18回　大阪市スポーツ協会会長杯　新体操ジュニア選手権大会\n兼　大阪新体操選手権大会　予選会（Ⅰ）"]
[]
[null,null,"所属団体名",null,{"$f":"IF(申込み手順!$F$7=\"\",\"\",申込み手順!$F$7)","v":""}]
[]
[null,null,"選　手　名"]
[]
["　　　上記の者は、この度の表記大会に参加することを承諾いたします。"]
[]
[null,null,"保護者　","住　　所"]
[]
[null,null,"保護者　","氏　名"]
[{"$nulls":8},"印"]
[]
[{"$nulls":7},"令和　　　　　年　　　　　月　　　　　日"]
[]
[]
[]
[]
[]
["大　会　参　加　承　諾　書"]
[]
["　　　大阪体操協会会長　様"]
[]
["　第18回　大阪市スポーツ協会会長杯　新体操ジュニア選手権大会\n兼　大阪新体操選手権大会　予選会（Ⅰ）"]
[]
[null,null,"所属団体名",null,{"$f":"IF(申込み手順!$F$7=\"\",\"\",申込み手順!$F$7)","v":""}]
[]
[null,null,"選　手　名"]
[]
["　　　上記の者は、この度の表記大会に参加することを承諾いたします。"]
[]
[null,null,"保護者　","住　　所"]
[]
[null,null,"保護者　","氏　名"]
[{"$nulls":8},"印"]
[]
{"$rows_left_out":2}
{"sheet":"名簿","index":3,"n_rows":674,"n_cols":23,"rows_kept":674,"hidden":true}
["個人ID","氏名","氏名（カナ）","年齢（4/1時点）","生年月日","性別","トランポリン会員番号","所属状態","承認日","所属完了日","所属団体ID","所属団体名","所属団体名（カナ）","男女別","競技種別","所属区分"]
[802007819,"澤 賢一","サワ ケンイチ",61,"1962/04/09","男性","","所属","2024/03/25","2024/04/02",522700785,"清風高等学校","セイフウコウトウガッコウ","男子のみ","新体操","指導者","545-0035","大阪市阿倍野区北畠3-11-11 ","携帯","09089351545","0666516030","0666516030","k.kimura@seifu.ac.jp"]
[803006446,"木村 功","キムラ コウ",36,"1987/12/13","男性","","所属","2024/04/16","2024/04/16",522700771,"清風中学校（新）","セイフウチュウガッコウ","男子のみ","新体操","指導者","577-0847","大阪府東大阪市岸田堂南町4-4 ","携帯","08055709994","","","k.kimura@seifu.ac.jp"]
[803006446,"木村 功","キムラ コウ",36,"1987/12/13","男性","","所属","2024/03/25","2024/04/02",522700785,"清風高等学校","セイフウコウトウガッコウ","男子のみ","新体操","指導者","577-0847","大阪府東大阪市岸田堂南町4-4 ","携帯","08055709994","","","k.kimura@seifu.ac.jp"]
[809023356,"松澤 斗柾","マツザワ トウマ",23,"2000/05/08","男性","","所属","2024/03/21","2024/03/27",522700813,"REX　SPORTS　CLUB","レックススポーツクラブ","男子および女子","新体操","指導者",""," ","自宅","0729812546","","","matuzawa1258@outlook.jp"]
[812065134,"壽賀 亮太","スガ リョウタ",26,"1997/09/18","男性","","所属","2024/04/15","2024/04/15",522700771,"清風中学校（新）","セイフウチュウガッコウ","男子のみ","新体操","指導者","536-0017","大阪府大阪市城東区新喜多東1?12?5 SGレガータ城東502","携帯","08056370650","","","r.suga@seifu.ac.jp"]
[812065134,"壽賀 亮太","スガ リョウタ",26,"1997/09/18","男性","","所属","2024/03/25","2024/04/02",522700785,"清風高等学校","セイフウコウトウガッコウ","男子のみ","新体操","指導者","536-0017","大阪府大阪市城東区新喜多東1?12?5 SGレガータ城東502","携帯","08056370650","","","r.suga@seifu.ac.jp"]
[812078606,"岡本 優人","オカモト マサト",24,"2000/02/13","男性","","所属","2024/03/25","2024/04/02",522700785,"清風高等学校","セイフウコウトウガッコウ","男子のみ","新体操","指導者","532-0025","大阪府大阪市淀川区新北野２ー６ー２３ パークナード新北野 １００４号室","携帯","08055709994","","","masa0213to@gmail.com"]
[814110172,"石川 雄一郎","イシカワ ユウイチロウ",41,"1983/03/08","男性","","所属","2024/03/21","2024/03/27",522700813,"REX　SPORTS　CLUB","レックススポーツクラブ","男子および女子","新体操","指導者",""," ","","","","",""]
[814122344,"尾上 達哉","オノエ タツヤ",22,"2001/05/31","男性","","所属","2024/04/16","2024/04/16",522700771,"清風中学校（新）","セイフウチュウガッコウ","男子のみ","新体操","指導者",""," ","携帯","09052475895","0668720312","","t.onoe.991122@icloud.com"]
[814122344,"尾上 達哉","オノエ タツヤ",22,"2001/05/31","男性","","所属","2024/04/10","2024/04/15",522700785,"清風高等学校","セイフウコウトウガッコウ","男子のみ","新体操","指導者",""," ","携帯","09052475895","0668720312","","t.onoe.991122@icloud.com"]
[816157817,"加部 柊翔","カベ シュウト",14,"2010/02/19","男性","","所属","2024/03/21","2024/03/27",522700813,"REX　SPORTS　CLUB","レックススポーツクラブ","男子および女子","新体操","選手",""," ","自宅","0671612145","","","vicsportsclub@yahoo.co.jp"]
[817191163,"忠岡 丈士郎","タダオカ ジョウシロウ",13,"2010/07/01","男性","","所属","2024/04/15","2024/04/16",522700771,"清風中学校（新）","セイフウチュウガッコウ","男子のみ","新体操","選手",""," ","","","","",""]
[817191171,"北村 壮史","キタムラ ソウシ",13,"2010/08/13","男性","","所属","2024/03/25","2024/04/02",522700771,"清風中学校（新）","セイフウチュウガッコウ","男子のみ","新体操","選手",""," ","","","","",""]
[818209086,"石川 琥太郎","イシカワ コタロウ",12,"2011/05/23","男性","","所属","2024/03/21","2024/03/27",522700813,"REX　SPORTS　CLUB","レックススポーツクラブ","男子および女子","新体操","選手",""," ","","","","",""]
[818217743,"髙松 慧太","タカマツ ケイタ",13,"2010/09/24","男性","","所属","2024/03/25","2024/04/02",522700771,"清風中学校（新）","セイフウチュウガッコウ","男子のみ","新体操","選手",""," ","","","","",""]
[819232161,"北井　 仁太","キタイ ジンタ",12,"2011/12/07","男性","","所属","2024/03/21","2024/03/27",522700813,"REX　SPORTS　CLUB","レックススポーツクラブ","男子および女子","新体操","選手",""," ","","","","",""]
[819246652,"柳田 拓海","ヤナギダ タクミ",17,"2006/07/28","男性","","所属","2024/03/25","2024/04/02",522700785,"清風高等学校","セイフウコウトウガッコウ","男子のみ","新体操","選手",""," ","","","","",""]
[819246667,"酒井 拓人","サカイ タクト",17,"2007/02/02","男性","","所属","2024/03/25","2024/04/02",522700785,"清風高等学校","セイフウコウトウガッコウ","男子のみ","新体操","選手",""," ","","","","",""]
[819246689,"桑畑 圭","クワバタ ケイ",17,"2006/04/11","男性","","所属","2024/03/25","2024/04/02",522700785,"清風高等学校","セイフウコウトウガッコウ","男子のみ","新体操","選手",""," ","","","","",""]
[820254419,"石川 颯次郎","イシカワ ソウジロウ",10,"2013/12/05","男性","","所属","2024/03/21","2024/03/27",522700813,"REX　SPORTS　CLUB","レックススポーツクラブ","男子および女子","新体操","選手",""," ","","","","",""]
[820255985,"佐倉 周","サクラ シュウ",31,"1992/10/29","男性","","所属","2024/04/24","2024/04/29",722700414,"SakulalaRG","サクラーラアールジー","女子のみ","新体操","指導者",""," ","","","","",""]
[820256367,"高坂 凜","コウサカ リン",16,"2007/04/23","男性","","所属","2024/03/25","2024/04/02",522700785,"清風高等学校","セイフウコウトウガッコウ","男子のみ","新体操","選手",""," ","","","","",""]
[820256377,"立見 祐一","タチミ ユウイチ",35,"1988/10/25","男性","","所属","2024/03/25","2024/04/02",522700785,"清風高等学校","セイフウコウトウガッコウ","男子のみ","新体操","指導者",""," ","","","","",""]
[820261171,"寺田 翔晴","テラダ ショウセイ",16,"2007/07/13","男性","","所属","2024/03/25","2024/04/02",522700785,"清風高等学校","セイフウコウトウガッコウ","男子のみ","新体操","選手",""," ","","","","",""]
[821279131,"柚山 寛治","ユウヤマ カンジ",15,"2008/10/08","男性","","所属","2024/03/25","2024/04/02",522700785,"清風高等学校","セイフウコウトウガッコウ","男子のみ","新体操","選手",""," ","","","","",""]
[821279141,"坂下 太一","サカシタ タイチ",15,"2009/01/24","男性","","所属","2024/03/25","2024/04/02",522700785,"清風高等学校","セイフウコウトウガッコウ","男子のみ","新体操","選手",""," ","","","","",""]
[821279157,"髙津 実希也","コウツ ミキヤ",15,"2009/01/27","男性","","所属","2024/03/25","2024/04/02",522700785,"清風高等学校","セイフウコウトウガッコウ","男子のみ","新体操","選手",""," ","","","","",""]
[822284211,"市村 叶大","イチムラ カナタ",10,"2014/03/19","男性","","所属","2024/05/26","2024/05/26",522700813,"REX　SPORTS　CLUB","レックススポーツクラブ","男子および女子","新体操","選手",""," ","","","","",""]
[822297880,"島 隼士","シマ ハヤト",14,"2009/12/10","男性","","所属","2024/03/25","2024/04/02",522700771,"清風中学校（新）","セイフウチュウガッコウ","男子のみ","新体操","選手",""," ","","","","",""]
[822297900,"境 数磨","サカイ カズマ",14,"2009/09/04","男性","","所属","2024/03/25","2024/04/02",522700771,"清風中学校（新）","セイフウチュウガッコウ","男子のみ","新体操","選手",""," ","","","","",""]
[822297914,"工藤 諒音","クドウ リオト",14,"2009/11/14","男性","","所属","2024/03/25","2024/04/02",522700771,"清風中学校（新）","セイフウチュウガッコウ","男子のみ","新体操","選手",""," ","","","","",""]
[822297926,"納庄 統馬","ノウショウ トウマ",14,"2009/07/21","男性","","所属","2024/03/25","2024/04/02",522700771,"清風中学校（新）","セイフウチュウガッコウ","男子のみ","新体操","選手",""," ","","","","",""]
[822297933,"遠藤 幌治","エンドウ コウジ",14,"2009/05/27","男性","","所属","2024/03/25","2024/04/02",522700771,"清風中学校（新）","セイフウチュウガッコウ","男子のみ","新体操","選手",""," ","","","","",""]
[822297956,"大島 秀夫","オオシマ ヨシオ",14,"2009/08/07","男性","","所属","2024/03/25","2024/04/02",522700771,"清風中学校（新）","セイフウチュウガッコウ","男子のみ","新体操","選手",""," ","","","","",""]
[822297961,"正木 太一","マサキ タイチ",14,"2009/08/08","男性","","所属","2024/03/25","2024/04/02",522700771,"清風中学校（新）","セイフウチュウガッコウ","男子のみ","新体操","選手",""," ","","","","",""]
[822297992,"加治屋 淳","カジヤ アツシ",14,"2010/01/23","男性","","所属","2024/03/25","2024/04/02",522700771,"清風中学校（新）","セイフウチュウガッコウ","男子のみ","新体操","選手",""," ","","","","",""]
[822298013,"岡本 涼","オカモト リョウ",17,"2006/06/12","男性","","所属","2024/03/25","2024/04/02",522700785,"清風高等学校","セイフウコウトウガッコウ","男子のみ","新体操","選手",""," ","","","","",""]
[822302317,"中村 漣","ナカムラ レン",17,"2006/11/16","男性","","所属","2024/03/25","2024/04/02",522700785,"清風高等学校","セイフウコウトウガッコウ","男子のみ","新体操","選手",""," ","","","","",""]
[824326404,"北野 元基","キタノ ゲンキ",16,"2007/09/10","男性","","所属","2024/04/19","2024/04/19",722700597,"府立泉大津高校","フリツイズミオオツコウコウ","男子のみ","新体操","選手",""," ","","","","",""]
{"$rows_left_out":634}